{"text_format":"1","workbook":"xlsx","n_sheets":9,"sheets":["Input Parameter","Data","Recommended Config","Detailed Product Structure","Gen2 Ready Program","Competitive Pricing","Version History","Bundles","Pulldowns"],"not_rendered":{"charts":0,"images":0,"macros":1,"external_links":2,"defined_names":15,"comments":2,"pivot_tables":0},"unopened":[],"bounds":{"document_bytes":16777216,"sheet_cells":100000,"rows_first":2000,"rows_last":500,"rows_between":2000,"halvings":0,"cell_chars":16384,"cell_head_chars":4096},"cells_cut":0,"cells_raw":0,"read":"whole","date_system":"1900"}

{"sheet":"Input Parameter","index":0,"n_rows":34,"n_cols":4,"rows_kept":34,"cut":false,"hidden":false,"merged":[]}
["PCIe Product Configurator"]
[]
[null,null,null,"1.) Select the appropriate configuration below."]
[null,null,null,"2.) Start the configuration with the butten to the left"]
[null,null,null,"3.) Find the result in the next workbook."]
[]
[]
["PCIe Configuration Parameter",null,null,"Please select the  configuration parameters: "]
[]
["Type:",null,null,"Type: Select if you want to configure an analyzer, an exerciser, a PTC, a Jammer or a combination.  The only supported combination right now is the analyzer/exerciser combination  "]
[]
["Linkwidth:",null,null,"Link width: Select the desired link width.  For both analyzer & exerciser, the maximum link width is x16.  For Jammer, the max link width possible is x8 "]
[]
["Speed:",null,null,"Link Speed Select the desired speed.  All Analyzer, exerciser and Jammer products are available to be licensed at 2.5Gb/s or 5.0Gb/s speed.   Gen2Ready is H/W capable of 5.0Gb/s, but licensed to 2.5Gb/s only.  Customer can upgrade at a later time."]
[]
{"$rows_left_out":20}
{"sheet":"Data","index":1,"n_rows":15,"n_cols":8,"rows_kept":15,"cut":false,"hidden":true,"merged":[]}
["String of selected value",{"$f":"INDEX(B5:B11,B2)","v":"Analyzer/Exerciser"},{"$f":"INDEX(C5:C15,C2)","v":"Interposer - 8Gb/s"},{"$f":"INDEX(D5:D8,D2)","v":"x16"},{"$f":"INDEX(E5:E7,E2)","v":"Gen3 - 8 Gb/s"},{"$f":"INDEX(F5:F8,F2)","v":"n/a"},{"$f":"INDEX(G5:G8,G2)","v":"n/a"},{"$f":"INDEX(H5:H8,H2)","v":"no"}]
["Index of selected value",3,11,4,3,1,3,2]
[]
[null,"Type","Probing","Linkwidth","Speed","Probing Type","P2L","Extended Receiver"]
[null,"Analyzer","Midbus - 5Gb/s","x1","Gen2 ready - 2.5Gb/s","n/a","P2L with 4 Flag Lines","yes"]
[null,"Exerciser","Interposer - 5Gb/s","x4","Gen2 - 5 Gb/s",null,"P2L with no Flags","no"]
[null,"Analyzer/Exerciser","Flying Lead - 5Gb/s","x8","Gen3 - 8 Gb/s","uni-directional","n/a"]
[null,"PTC II","Midbus - 2.5Gb/s","x16"]
[null,"Jammer","Interposer - 2.5Gb/s"]
[null,null,"Flying Lead - 2.5Gb/s"]
[null,null,"Express Card - 2.5Gb/s"]
[null,null,"Half Size Midbus - 5Gb/s"]
[null,null,"Half Size Midbus - 2.5Gb/s"]
[null,null,"Midbus - 8Gb/s"]
[null,null,"Interposer - 8Gb/s"]
{"$rows_left_out":1}
{"sheet":"Recommended Config","index":2,"n_rows":154,"n_cols":12,"rows_kept":154,"cut":false,"hidden":false,"merged":[]}
[null,"Recommended Configuration for PCI Express Protocol Test"]
["yes","Line item",null,null,"Product #","Description","Qty","Price Ea.",null,"PAD","Net Price Ea.","Extend Price"]
["yes","Line item",null,null,"Product #","Description","Qty","Price Ea.","Price Ea.","PAD","Net Price Ea.","Extend Price"]
[{"$f":"IF(Data!E1=Data!E7,\"yes\",\"no\")","v":"yes"},{"$f":"IF(A4=\"yes\",B60+1,0)","v":1},"Gen3 Products (Digital Test Console)"]
[{"$f":"IF(AND(OR(Data!B1=Data!B5,Data!B1=Data!B7), A4=\"yes\"),\"yes\",\"no\")","v":"yes"},null,null,"Chassis","U4002A",{"$f":"VLOOKUP(E5, 'Detailed Product Structure'!E$9:J$331, 4, FALSE)","v":"Digital Test Console Chassis two slot chassis"},{"$f":"IF(A5=\"yes\",1,0)","v":1},{"$f":"VLOOKUP(E5, 'Detailed Product Structure'!$E$9:$J$331, 6, FALSE)","v":7500},null,{"$f":"'Input Parameter'!$B$28","v":0},{"$f":"(1-J5)*H5","v":7500},{"$f":"G5*K5","v":7500}]
[{"$f":"$A$5","v":"yes"},null,null,null,"U4002A-SFT",{"$f":"VLOOKUP(E6, 'Detailed Product Structure'!E$9:J$331, 4, FALSE)","v":"Soft carrying bag for Digital test console two slot chassis"},{"$f":"IF(A6=\"yes\",1,0)","v":1},{"$f":"VLOOKUP(E6, 'Detailed Product Structure'!$E$9:$J$331, 6, FALSE)","v":156},null,{"$f":"'Input Parameter'!$B$28","v":0},{"$f":"(1-J6)*H6","v":156},{"$f":"G6*K6","v":156}]
[{"$f":"$A$5","v":"yes"},null,null,null,"U4002A-PCH",{"$f":"VLOOKUP(E7, 'Detailed Product Structure'!E$9:J$331, 4, FALSE)","v":"Accessories pouch kit for Digital test console two slot chassis"},1,{"$f":"VLOOKUP(E7, 'Detailed Product Structure'!$E$9:$J$331, 6, FALSE)","v":156},null,{"$f":"'Input Parameter'!$B$28","v":0},156,156]
["yes",null,null,null,null,"Note: These soft carry case or accessory pouch are optional"]
["yes",null,null,null,"U4002A-2MC",{"$f":"VLOOKUP(E9, 'Detailed Product Structure'!E$9:J$331, 4, FALSE)","v":"PCIe cable (2.0m)"},1,{"$f":"VLOOKUP(E9, 'Detailed Product Structure'!$E$9:$J$331, 6, FALSE)","v":250},null,{"$f":"'Input Parameter'!$B$28","v":0},{"$f":"(1-J9)*H9","v":250},{"$f":"G9*K9","v":250}]
["yes",null,null,null,"U4002A-5MC",{"$f":"VLOOKUP(E10, 'Detailed Product Structure'!E$9:J$331, 4, FALSE)","v":"PCIe cable (5.0m)"},1,{"$f":"VLOOKUP(E10, 'Detailed Product Structure'!$E$9:$J$331, 6, FALSE)","v":450},null,{"$f":"'Input Parameter'!$B$28","v":0},{"$f":"(1-J10)*H10","v":450},{"$f":"G10*K10","v":450}]
["yes",null,null,null,null,"Note: Only one cable is required for operation, either the 2.0 m or 5.0 m.  "]
["yes",null,null,null,"U4002A-EXP",{"$f":"VLOOKUP(E12, 'Detailed Product Structure'!E$9:J$331, 4, FALSE)","v":"PCI Express cable to express card adapter for laptop connections"},1,{"$f":"VLOOKUP(E12, 'Detailed Product Structure'!$E$9:$J$331, 6, FALSE)","v":450},null,{"$f":"'Input Parameter'!$B$28","v":0},{"$f":"(1-J12)*H12","v":450},{"$f":"G12*K12","v":450}]
["yes",null,null,null,"U4002A-SLT",{"$f":"VLOOKUP(E13, 'Detailed Product Structure'!E$9:J$331, 4, FALSE)","v":"PCI Express cable to slot adapter for desktop connections"},1,{"$f":"VLOOKUP(E13, 'Detailed Product Structure'!$E$9:$J$331, 6, FALSE)","v":450},null,{"$f":"'Input Parameter'!$B$28","v":0},{"$f":"(1-J13)*H13","v":450},{"$f":"G13*K13","v":450}]
["yes",null,null,null,null,"Note: One of the two cable adapters are required to be able to connect to a PC controller"]
[{"$f":"IF(AND(OR(Data!$B$1=Data!$B$5,Data!$B$1=Data!$B$7), A4=\"yes\"),\"yes\",\"no\")","v":"yes"},null,null,"Analyzer","U4301A",{"$f":"VLOOKUP(E15, 'Detailed Product Structure'!E$9:J$331, 4, FALSE)","v":"Analyzer module for PCIe 8Gbps"},{"$f":"IF(AND(A19=\"yes\",A15=\"yes\"),2,IF(A15=\"yes\",1,))","v":2},{"$f":"VLOOKUP(E15, 'Detailed Product Structure'!$E$9:$J$331, 6, FALSE)","v":0},null,{"$f":"'Input Parameter'!$B$28","v":0},{"$f":"(1-J15)*H15","v":0},{"$f":"G15*K15","v":0}]
{"$rows_left_out":140}
{"sheet":"Detailed Product Structure","index":3,"n_rows":331,"n_cols":18,"rows_kept":331,"cut":false,"hidden":false,"merged":[[10,16,10,17],[1,4,1,17],[7,16,7,17],[8,16,8,17],[9,16,9,17],[2,16,2,17],[3,16,3,17],[4,14,4,15],[4,16,4,17],[5,1,5,2],[6,1,6,2],[2,14,2,15],[3,10,3,11],[3,14,3,15],[4,1,4,2],[2,1,2,2],[3,1,3,2],[190,16,190,17],[191,16,191,17],[192,16,192,17],[193,16,193,17],[12,16,12,17],[92,16,92,17],[19,16,19,17],[14,16,14,17],[15,16,15,17]]}
[]
[]
[null," ",null,null,"Owner (Product Mgr.)",null,null,"Yenyi Fu TN 345 8716",null,null,null,null,null,null,"Date:"]
[null," ",null,null,"CPL Date",null,null,null,null,"Update:","2007-12-21",null,null,null,"CP passed: "]
[null," ",null,null,"RMU: Sub-Family",null,null,"256462 : SPT",null,"Status Pre-Production, PW protected",null,null,null,null,"next CP: "]
[null," ",null,null,"Default Warranty",null,null,"1 Year RTA",null,"ECR: "]
[null," ",null,null,"Calibration Intervall",null,null,"1 Year"]
["NOTES","New / Change","Min/ Max","Level","Product #","Master Item type","Org Item type","Product Description\nmax. 80 Character","WW-Ref. Price (US$) Config=YES","US List Price (*1,03 US$) Config=NO","SRT/ATP\nweeks","internal order (Y/N)","required  / Opt. (R/O)","CPL Exclude (Y/N)","Plg.-%","Zoll Class. (Y/N)","Comments"]
[null,null,null,null,"E29600","Merchandizing","Merchandizing","System Protocol Tester PCIe series "]
[null,null,null,0,"E2960B","PTO","PTO","System Protocol Tester Series for PCIe 5Gb/s",0,{"$f":"+I10*1.03","v":0},88,null,null,"Y"]
[null,null,null,1,"E2960B-MEC","PTO","PTO","Express Card Adapter for PCIe 2.5Gb/s for N4241A",0,530,88,null,null,"Y"]
[null,null,null,1,"E2960B-LAN","PTO","PTO","USB to LAN Adapter for Chassis to Controller Connectivity",null,52]
[null,null,null,1,"E2960B-ATP001","ATPLT","ATPLT","ATP Lead-time item",0,{"$f":"+I13*1.03","v":0},88,null,null,"Y"]
[null,null,null,1,"E2960B-KIT","PTO Kit Config Only","PTO Kit Config Only",null,null,null,null,null,null,"Y"]
[null,null,null,null,"PS-S20-01",null,null,"1 Day of start-up assistance",null,null,null,null,null,"Y"]
{"$rows_left_out":317}
{"sheet":"Gen2 Ready Program","index":4,"n_rows":59,"n_cols":14,"rows_kept":59,"cut":false,"hidden":true,"merged":[]}
["The Gen2 Ready Program gives our customer the ability to purchase hardware that is capable of going to Gen2 (5.0 Gb/s), but licensed at Gen1, and at a Gen1 price. "]
["This gives the customer an flexible upgrade path to Gen2 speeds at a later date."]
["For more information on Gen2Ready program, look at publication : 5990-3159EN.pdf"]
[]
[]
["Analyzer"]
[]
["Link"]
[null,"Gen1 Only",null,null,"Gen2 Ready Configuration",null,null,"Upgrade to Gen2","Gen2 Configuration",null,null,"Gen2 Ready Configuration - with Gen1 Probes"]
["x1",null,null,{"$f":"SUM(D11:D14)","v":16598},null,null,{"$f":"SUM(G11:G14)","v":20669},42117,null,null,{"$f":"SUM(K11:K14)","v":58550},null,null,{"$f":"SUM(N11:N15)","v":15994}]
[null,"E2960A-A01","Protocol Analyzer for PCI Express x1",16598,"N5306A",{"$f":"VLOOKUP(E11,'Detailed Product Structure'!$E$10:$J$171,4,FALSE)","v":"Analyzer Module for PCIe 5Gb/s (requires 2 for x 16)"},{"$f":"VLOOKUP(E11,'Detailed Product Structure'!$E$10:$J$171,6,FALSE)","v":30300},"N5310U-U21","N5306A",{"$f":"VLOOKUP(I11,'Detailed Product Structure'!$E$10:$J$171,4,FALSE)","v":"Analyzer Module for PCIe 5Gb/s (requires 2 for x 16)"},{"$f":"VLOOKUP(I11,'Detailed Product Structure'!$E$10:$J$171,6,FALSE)","v":30300},"N5306A",{"$f":"VLOOKUP(L11,'Detailed Product Structure'!$E$10:$J$171,4,FALSE)","v":"Analyzer Module for PCIe 5Gb/s (requires 2 for x 16)"},{"$f":"VLOOKUP(L11,'Detailed Product Structure'!$E$10:$J$171,6,FALSE)","v":30300}]
[null,null,null,null,"N5306A-G01",{"$f":"VLOOKUP(E12,'Detailed Product Structure'!$E$10:$J$171,4,FALSE)","v":"Analyzer SW License x1 for PCIe 2.5 Gb/s"},{"$f":"VLOOKUP(E12,'Detailed Product Structure'!$E$10:$J$171,6,FALSE)","v":-24886},{"$f":"(G10+H10)/K10-1","v":7.2348420153714788E-2},"N5306A-A01",{"$f":"VLOOKUP(I12,'Detailed Product Structure'!$E$10:$J$171,4,FALSE)","v":"Analyzer SW License x1 for PCIe 5Gb/s"},{"$f":"VLOOKUP(I12,'Detailed Product Structure'!$E$10:$J$171,6,FALSE)","v":12995},"N5306A-G01",{"$f":"VLOOKUP(L12,'Detailed Product Structure'!$E$10:$J$171,4,FALSE)","v":"Analyzer SW License x1 for PCIe 2.5 Gb/s"},{"$f":"VLOOKUP(L12,'Detailed Product Structure'!$E$10:$J$171,6,FALSE)","v":-24886}]
[null,null,null,null,"N5315A-A01",{"$f":"VLOOKUP(E13,'Detailed Product Structure'!$E$10:$J$171,4,FALSE)","v":"Slot Interposer x1 for PCIe 5Gb/s"},{"$f":"VLOOKUP(E13,'Detailed Product Structure'!$E$10:$J$171,6,FALSE)","v":10137},null,"N5315A-A01",{"$f":"VLOOKUP(I13,'Detailed Product Structure'!$E$10:$J$171,4,FALSE)","v":"Slot Interposer x1 for PCIe 5Gb/s"},{"$f":"VLOOKUP(I13,'Detailed Product Structure'!$E$10:$J$171,6,FALSE)","v":10137},"E2945A","Passive x1 probe for Gen1 Only",2754]
[null,null,null,null,"N5302A",{"$f":"VLOOKUP(E14,'Detailed Product Structure'!$E$10:$J$171,4,FALSE)","v":"2-slot portable chassis"},{"$f":"VLOOKUP(E14,'Detailed Product Structure'!$E$10:$J$171,6,FALSE)","v":5118},null,"N5302A",{"$f":"VLOOKUP(I14,'Detailed Product Structure'!$E$10:$J$171,4,FALSE)","v":"2-slot portable chassis"},{"$f":"VLOOKUP(I14,'Detailed Product Structure'!$E$10:$J$171,6,FALSE)","v":5118},"N5302A",{"$f":"VLOOKUP(L14,'Detailed Product Structure'!$E$10:$J$171,4,FALSE)","v":"2-slot portable chassis"},{"$f":"VLOOKUP(L14,'Detailed Product Structure'!$E$10:$J$171,6,FALSE)","v":5118}]
[null,null,null,null,null,null,null,null,null,null,null,"N5317A",{"$f":"VLOOKUP(L15,'Detailed Product Structure'!$E$10:$J$171,4,FALSE)","v":"Cable to connect E2960A probe to E2960B series"},{"$f":"VLOOKUP(L15,'Detailed Product Structure'!$E$10:$J$171,6,FALSE)","v":2708}]
{"$rows_left_out":45}
{"sheet":"Competitive Pricing","index":5,"n_rows":120,"n_cols":35,"rows_kept":120,"cut":false,"hidden":false,"merged":[[79,16,80,16],[17,5,18,5],[79,5,80,5],[17,27,18,27],[79,27,80,27]]}
["Gen2 ","Gen2 Analyzer"]
[null,null,"2004 Prices",null,null,null,null,null,null,null,null,null,null,"2007 Prices",null,null,null,null,null,null,null,null,null,null,"2008 Prices"]
[null,"Link","Agilent 2004 Prices",null,null,"LeCroy Pricing (2004 Prices)",null,null,null,"Tek Pricing (2004)",null,null,null,null,null,null,"LeCroy Pricing (Feb 07)",null,null,null,"Tek Pricing",null,null,null,null,null,null,"LeCroy Pricing (unless specified, last updated Feb 07)",null,null,null,"Tek Pricing"]
[null,null,null,null,null,"US","Japan","Asia","Europe","US","Japan","Asia","Europe","Gen2 Configuration (Slot interposer probes)",null,null,"US","Japan","Asia","Europe","US","Japan","Asia","Europe","Gen2 Configuration (Slot interposer probes)",null,null,"US","Japan","Asia","Europe","US","Japan","Asia","Europe"]
[null,"x1",null,null,null,null,null,null,null,null,null,null,null,null,null,{"$f":"SUM(P6:P9)","v":{"$error":"#N/A"}},null,null,null,null,null,null,null,null,null,null,{"$f":"SUM(AA6:AA9)","v":{"$error":"#N/A"}}]
[null,null,null,null,null,null,null,null,null,null,null,null,null,"N5306A",{"$f":"VLOOKUP(N6,'Detailed Product Structure'!$E$10:$J$171,4,FALSE)","v":"Analyzer Module for PCIe 5Gb/s (requires 2 for x 16)"},{"$f":"VLOOKUP(N6,'Detailed Product Structure'!$E$10:$J$171,6,FALSE)","v":30300},null,null,null,null,55000,null,null,null,"N5306A",{"$f":"VLOOKUP(Y6,'Detailed Product Structure'!$E$10:$J$171,4,FALSE)","v":"Analyzer Module for PCIe 5Gb/s (requires 2 for x 16)"},{"$f":"VLOOKUP(Y6,'Detailed Product Structure'!$E$10:$J$171,6,FALSE)","v":30300}]
[null,null,"N/A",null,null,null,null,null,null,null,null,null,null,"N5306A-A01",{"$f":"VLOOKUP(N7,'Detailed Product Structure'!$E$10:$J$171,4,FALSE)","v":"Analyzer SW License x1 for PCIe 5Gb/s"},{"$f":"VLOOKUP(N7,'Detailed Product Structure'!$E$10:$J$171,6,FALSE)","v":12995},null,null,null,null,null,null,null,null,"N5306A-A01",{"$f":"VLOOKUP(Y7,'Detailed Product Structure'!$E$10:$J$171,4,FALSE)","v":"Analyzer SW License x1 for PCIe 5Gb/s"},{"$f":"VLOOKUP(Y7,'Detailed Product Structure'!$E$10:$J$171,6,FALSE)","v":12995}]
[null,null,null,null,null,null,null,null,null,null,null,null,null,"N5315A-A01",{"$f":"VLOOKUP(N8,'Detailed Product Structure'!$E$10:$J$171,4,FALSE)","v":"Slot Interposer x1 for PCIe 5Gb/s"},{"$f":"VLOOKUP(N8,'Detailed Product Structure'!$E$10:$J$171,6,FALSE)","v":10137},null,null,null,null,null,null,null,null,"N5315A-A01",{"$f":"VLOOKUP(Y8,'Detailed Product Structure'!$E$10:$J$171,4,FALSE)","v":"Slot Interposer x1 for PCIe 5Gb/s"},{"$f":"VLOOKUP(Y8,'Detailed Product Structure'!$E$10:$J$171,6,FALSE)","v":10137}]
[null,null,null,null,null,null,null,null,null,null,null,null,null,"N5540A",{"$f":"VLOOKUP(N9,'Detailed Product Structure'!$E$10:$J$171,4,FALSE)","v":{"$error":"#N/A"}},{"$f":"VLOOKUP(N9,'Detailed Product Structure'!$E$10:$J$171,6,FALSE)","v":{"$error":"#N/A"}},null,null,null,null,null,null,null,null,"N5540A",{"$f":"VLOOKUP(Y9,'Detailed Product Structure'!$E$10:$J$171,4,FALSE)","v":{"$error":"#N/A"}},{"$f":"VLOOKUP(Y9,'Detailed Product Structure'!$E$10:$J$171,6,FALSE)","v":{"$error":"#N/A"}}]
[]
[null,"x4",null,null,null,null,null,null,null,null,null,null,null,null,null,{"$f":"SUM(P12:P16)","v":{"$error":"#N/A"}},null,null,null,null,null,null,null,null,null,null,{"$f":"SUM(AA12:AA16)","v":{"$error":"#N/A"}},50000]
[null,null,null,null,null,null,null,null,null,null,null,null,null,"N5306A",{"$f":"VLOOKUP(N12,'Detailed Product Structure'!$E$10:$J$171,4,FALSE)","v":"Analyzer Module for PCIe 5Gb/s (requires 2 for x 16)"},{"$f":"VLOOKUP(N12,'Detailed Product Structure'!$E$10:$J$171,6,FALSE)","v":30300},null,null,null,null,55000,null,null,null,"N5306A",{"$f":"VLOOKUP(Y12,'Detailed Product Structure'!$E$10:$J$171,4,FALSE)","v":"Analyzer Module for PCIe 5Gb/s (requires 2 for x 16)"},{"$f":"VLOOKUP(Y12,'Detailed Product Structure'!$E$10:$J$171,6,FALSE)","v":30300}]
[null,null,null,null,null,null,null,null,null,null,null,null,null,"N5306A-A04",{"$f":"VLOOKUP(N13,'Detailed Product Structure'!$E$10:$J$171,4,FALSE)","v":"Analyzer SW License x4 for PCIe 5Gb/s"},{"$f":"VLOOKUP(N13,'Detailed Product Structure'!$E$10:$J$171,6,FALSE)","v":19110},null,null,null,null,null,null,null,null,"N5306A-A04",{"$f":"VLOOKUP(Y13,'Detailed Product Structure'!$E$10:$J$171,4,FALSE)","v":"Analyzer SW License x4 for PCIe 5Gb/s"},{"$f":"VLOOKUP(Y13,'Detailed Product Structure'!$E$10:$J$171,6,FALSE)","v":19110}]
[null,null,null,null,null,null,null,null,null,null,null,null,null,"N5315A-A04",{"$f":"VLOOKUP(N14,'Detailed Product Structure'!$E$10:$J$171,4,FALSE)","v":"Slot Interposer x4 for PCIe 5Gb/s"},{"$f":"VLOOKUP(N14,'Detailed Product Structure'!$E$10:$J$171,6,FALSE)","v":12364},null,null,null,null,null,null,null,null,"N5315A-A04",{"$f":"VLOOKUP(Y14,'Detailed Product Structure'!$E$10:$J$171,4,FALSE)","v":"Slot Interposer x4 for PCIe 5Gb/s"},{"$f":"VLOOKUP(Y14,'Detailed Product Structure'!$E$10:$J$171,6,FALSE)","v":12364}]
[]
{"$rows_left_out":106}
{"sheet":"Version History","index":6,"n_rows":121,"n_cols":2,"rows_kept":121,"cut":false,"hidden":false,"merged":[]}
["Version 2.12"]
["July 21st, 2010"]
[]
["Changes/Enhancements/Bug Fixes"]
[]
["Enhancement","Added U4305A-004 optioin"]
["Enhancement","Changed option \"LTSSM\" to option \"LT3\""]
["Enhancement","Removed Gen1 Probes"]
[]
["Version 2.11"]
["May 12th, 2010"]
[]
["Changes/Enhancements/Bug Fixes"]
[]
["Enhancement","Changed the chassis to N5302A/N5304A"]
{"$rows_left_out":107}
{"sheet":"Bundles","index":7,"n_rows":78,"n_cols":4,"rows_kept":78,"cut":false,"hidden":true,"merged":[]}
["Configuration","Products#","Description","Prices"]
["Analyzer and Midbus Configuration x8"]
[null,"N5306A",{"$f":"VLOOKUP(B3,'Detailed Product Structure'!$E$9:$I$134,4,FALSE)","v":"Analyzer Module for PCIe 5Gb/s (requires 2 for x 16)"},{"$f":"VLOOKUP(B3,'Detailed Product Structure'!$E$9:$I$134,5,FALSE)","v":26700}]
[null,"N5306A-A08",{"$f":"VLOOKUP(B4,'Detailed Product Structure'!$E$9:$I$134,4,FALSE)","v":"Analyzer SW License x8 for PCIe 5Gb/s"},{"$f":"VLOOKUP(B4,'Detailed Product Structure'!$E$9:$I$134,5,FALSE)","v":0}]
[null,"N4241A",{"$f":"VLOOKUP(B5,'Detailed Product Structure'!$E$9:$I$134,4,FALSE)","v":"Midbus Probe 2.0 bi-directional x8 for PCIe 5Gb/s"},{"$f":"VLOOKUP(B5,'Detailed Product Structure'!$E$9:$I$134,5,FALSE)","v":0}]
[null,"N5540A",{"$f":"VLOOKUP(B6,'Detailed Product Structure'!$E$9:$I$134,4,FALSE)","v":{"$error":"#N/A"}},{"$f":"VLOOKUP(B6,'Detailed Product Structure'!$E$9:$I$134,5,FALSE)","v":{"$error":"#N/A"}}]
[null,null,null,{"$f":"SUM(D6:D6)","v":{"$error":"#N/A"}}]
[]
["Analyzer and Midbus Configuration x16"]
[null,"N5306A",{"$f":"VLOOKUP(B10,'Detailed Product Structure'!$E$9:$I$134,4,FALSE)","v":"Analyzer Module for PCIe 5Gb/s (requires 2 for x 16)"},{"$f":"VLOOKUP(B10,'Detailed Product Structure'!$E$9:$I$134,5,FALSE)","v":26700}]
[null,"N5306A",{"$f":"VLOOKUP(B11,'Detailed Product Structure'!$E$9:$I$134,4,FALSE)","v":"Analyzer Module for PCIe 5Gb/s (requires 2 for x 16)"},{"$f":"VLOOKUP(B11,'Detailed Product Structure'!$E$9:$I$134,5,FALSE)","v":26700}]
[null,"N5306A-A16",{"$f":"VLOOKUP(B12,'Detailed Product Structure'!$E$9:$I$134,4,FALSE)","v":"Analyzer SW License x16 for PCIe 5Gb/s"},{"$f":"VLOOKUP(B12,'Detailed Product Structure'!$E$9:$I$134,5,FALSE)","v":0}]
[null,"N4241A",{"$f":"VLOOKUP(B13,'Detailed Product Structure'!$E$9:$I$134,4,FALSE)","v":"Midbus Probe 2.0 bi-directional x8 for PCIe 5Gb/s"},{"$f":"VLOOKUP(B13,'Detailed Product Structure'!$E$9:$I$134,5,FALSE)","v":0}]
[null,"N4241A",{"$f":"VLOOKUP(B14,'Detailed Product Structure'!$E$9:$I$134,4,FALSE)","v":"Midbus Probe 2.0 bi-directional x8 for PCIe 5Gb/s"},{"$f":"VLOOKUP(B14,'Detailed Product Structure'!$E$9:$I$134,5,FALSE)","v":0}]
[null,"N5541A",{"$f":"VLOOKUP(B15,'Detailed Product Structure'!$E$9:$I$134,4,FALSE)","v":{"$error":"#N/A"}},{"$f":"VLOOKUP(B15,'Detailed Product Structure'!$E$9:$I$134,5,FALSE)","v":{"$error":"#N/A"}}]
{"$rows_left_out":64}
{"sheet":"Pulldowns","index":8,"n_rows":30,"n_cols":9,"rows_kept":30,"cut":false,"hidden":true,"merged":[[3,0,10,0],[20,0,20,2],[21,0,21,2],[22,0,22,2],[23,0,23,2],[29,0,29,2],[24,0,24,2],[25,0,25,2],[26,0,26,2],[27,0,27,2],[28,0,28,2]]}
["Product Group","Product Category","RMU :Sub-Family",null,"Owner","Warranty","Calibration \nInterval",null,"New / \nChange"]
["ParBERT",null,"256459 : ParBERT",null,"Thorsten Goetzelmann / TN 778 -1215","1 Year RTA","1 Year",null,"New"]
["Serial BERT",null,"259637 : Serial_BERT",null,"Ellen Spindler / TN 778-8326","1 Year RTA with extension to 3 & 5 year","2 Year",null,"Remove"]
["Pulse Generator","Starbase","256460 : PPGs",null,"Beate Hoehne / TN 778-3024","3 Year RTA","3 Year",null,"Change"]
[null,"8110A","256462 : SPT",null,"Michael Droemmer / TN 778-3321","1 Year Onsite","4 Year"]
[null,"8114A",null,null,"Sandra Oberdorfer / TN 590-2221","1 Year Onsite with extension to 3 & 5 years","5 Year"]
[null,"8133A",null,null,"Joerg Striegel / TN 778-8329","???","N.A."]
[null,"81133A",null,null,"Alexander Schmidt (Bitifye)"," ","???"]
[null,"8305A, 8306A CASS",null,null,"???"]
[null,"Others, 3324, Accessories"]
[null,null,"???"]
["RMD"]
["SPT"]
[]
[]
{"$rows_left_out":15}